{"text_format":"1","workbook":"xlsx","n_sheets":3,"sheets":["Battery Calculator for Runtime","Runtime Calculator","Data"],"not_rendered":{"charts":0,"images":2,"macros":1,"external_links":0,"defined_names":5,"comments":0,"pivot_tables":0},"unopened":[],"bounds":{"document_bytes":16777216,"sheet_cells":100000,"rows_first":2000,"rows_last":500,"rows_between":2000,"halvings":0,"cell_chars":16384,"cell_head_chars":4096},"cells_cut":0,"cells_raw":0,"read":"whole","date_system":"1900"}

{"sheet":"Battery Calculator for Runtime","index":0,"n_rows":39,"n_cols":8,"rows_kept":39,"cut":false,"hidden":false,"merged":[[1,2,2,4],[38,7,39,7],[38,1,39,1],[36,1,37,1],[38,2,39,2],[38,3,39,3],[38,4,39,4],[38,5,39,5],[38,6,39,6],[36,3,37,3],[36,2,37,2],[36,4,37,4],[36,5,37,5],[36,6,37,6],[36,7,37,7]]}
[]
[null,null,"Lithium Ion Battery Calculator"]
[]
[]
[null,"Cells in Series",5]
[null,"Cells in Paralell",2]
[null,"Standard Discharge Current (in Amps)",5]
[null,"Max Discharge Current (in Amps)",30]
[]
[null,null,"Cell Characteristics"]
[null,"Cell Type","High Power","High Power","High Power","High Capacity","High Capacity","High Power"]
[null,"Vendor","Moli","LithiumWerks","Moli","LG","LG","Panasonic"]
[null,"Model","INR18650-P26A","ANR26650M1B","INR-21700-P42A","INR18650MJ1","INR18650MJ1","UR18650A"]
[null,"Chemistry","Lithium Ion","Lithium Iron Phosphate","Lithium Ion","Lithium Ion","Lithium Ion","Lithium Ion"]
[null,"Size",18650,26650,21700,18650,18650,18650]
[null,"Nominal Capacity",{"$f":"IFERROR( _xlfn.XLOOKUP($B16,'Runtime Calculator'!$A$17:$A$24,_xlfn.XLOOKUP(C$13,'Runtime Calculator'!$B$12:$D$12,'Runtime Calculator'!$B$17:$D$24)),\"\")","v":2600},{"$f":"IFERROR( _xlfn.XLOOKUP($B16,'Runtime Calculator'!$A$17:$A$24,_xlfn.XLOOKUP(D$13,'Runtime Calculator'!$B$12:$D$12,'Runtime Calculator'!$B$17:$D$24)),\"\")","v":2600},{"$f":"IFERROR( _xlfn.XLOOKUP($B16,'Runtime Calculator'!$A$17:$A$24,_xlfn.XLOOKUP(E$13,'Runtime Calculator'!$B$12:$D$12,'Runtime Calculator'!$B$17:$D$24)),\"\")","v":4200},{"$f":"IFERROR( _xlfn.XLOOKUP($B16,'Runtime Calculator'!$A$17:$A$24,_xlfn.XLOOKUP(F$13,'Runtime Calculator'!$B$12:$D$12,'Runtime Calculator'!$B$17:$D$24)),\"\")","v":""},{"$f":"IFERROR( _xlfn.XLOOKUP($B16,'Runtime Calculator'!$A$17:$A$24,_xlfn.XLOOKUP(G$13,'Runtime Calculator'!$B$12:$D$12,'Runtime Calculator'!$B$17:$D$24)),\"\")","v":""},{"$f":"IFERROR( _xlfn.XLOOKUP($B16,'Runtime Calculator'!$A$17:$A$24,_xlfn.XLOOKUP(H$13,'Runtime Calculator'!$B$12:$D$12,'Runtime Calculator'!$B$17:$D$24)),\"\")","v":""}]
[null,"Minimum Capacity",{"$f":"IFERROR( _xlfn.XLOOKUP($B17,'Runtime Calculator'!$A$17:$A$24,_xlfn.XLOOKUP(C$13,'Runtime Calculator'!$B$12:$D$12,'Runtime Calculator'!$B$17:$D$24)),\"\")","v":0},{"$f":"IFERROR( _xlfn.XLOOKUP($B17,'Runtime Calculator'!$A$17:$A$24,_xlfn.XLOOKUP(D$13,'Runtime Calculator'!$B$12:$D$12,'Runtime Calculator'!$B$17:$D$24)),\"\")","v":2500},{"$f":"IFERROR( _xlfn.XLOOKUP($B17,'Runtime Calculator'!$A$17:$A$24,_xlfn.XLOOKUP(E$13,'Runtime Calculator'!$B$12:$D$12,'Runtime Calculator'!$B$17:$D$24)),\"\")","v":4000},{"$f":"IFERROR( _xlfn.XLOOKUP($B17,'Runtime Calculator'!$A$17:$A$24,_xlfn.XLOOKUP(F$13,'Runtime Calculator'!$B$12:$D$12,'Runtime Calculator'!$B$17:$D$24)),\"\")","v":""},{"$f":"IFERROR( _xlfn.XLOOKUP($B17,'Runtime Calculator'!$A$17:$A$24,_xlfn.XLOOKUP(G$13,'Runtime Calculator'!$B$12:$D$12,'Runtime Calculator'!$B$17:$D$24)),\"\")","v":""},{"$f":"IFERROR( _xlfn.XLOOKUP($B17,'Runtime Calculator'!$A$17:$A$24,_xlfn.XLOOKUP(H$13,'Runtime Calculator'!$B$12:$D$12,'Runtime Calculator'!$B$17:$D$24)),\"\")","v":""}]
[null,"Voltage",{"$f":"IFERROR( _xlfn.XLOOKUP($B18,'Runtime Calculator'!$A$17:$A$24,_xlfn.XLOOKUP(C$13,'Runtime Calculator'!$B$12:$D$12,'Runtime Calculator'!$B$17:$D$24)),\"\")","v":3.6},{"$f":"IFERROR( _xlfn.XLOOKUP($B18,'Runtime Calculator'!$A$17:$A$24,_xlfn.XLOOKUP(D$13,'Runtime Calculator'!$B$12:$D$12,'Runtime Calculator'!$B$17:$D$24)),\"\")","v":3.3},{"$f":"IFERROR( _xlfn.XLOOKUP($B18,'Runtime Calculator'!$A$17:$A$24,_xlfn.XLOOKUP(E$13,'Runtime Calculator'!$B$12:$D$12,'Runtime Calculator'!$B$17:$D$24)),\"\")","v":3.6},{"$f":"IFERROR( _xlfn.XLOOKUP($B18,'Runtime Calculator'!$A$17:$A$24,_xlfn.XLOOKUP(F$13,'Runtime Calculator'!$B$12:$D$12,'Runtime Calculator'!$B$17:$D$24)),\"\")","v":""},{"$f":"IFERROR( _xlfn.XLOOKUP($B18,'Runtime Calculator'!$A$17:$A$24,_xlfn.XLOOKUP(G$13,'Runtime Calculator'!$B$12:$D$12,'Runtime Calculator'!$B$17:$D$24)),\"\")","v":""},{"$f":"IFERROR( _xlfn.XLOOKUP($B18,'Runtime Calculator'!$A$17:$A$24,_xlfn.XLOOKUP(H$13,'Runtime Calculator'!$B$12:$D$12,'Runtime Calculator'!$B$17:$D$24)),\"\")","v":""}]
[null,"Cutoff Voltag",{"$f":"IFERROR( _xlfn.XLOOKUP($B19,'Runtime Calculator'!$A$17:$A$24,_xlfn.XLOOKUP(C$13,'Runtime Calculator'!$B$12:$D$12,'Runtime Calculator'!$B$17:$D$24)),\"\")","v":2.5},{"$f":"IFERROR( _xlfn.XLOOKUP($B19,'Runtime Calculator'!$A$17:$A$24,_xlfn.XLOOKUP(D$13,'Runtime Calculator'!$B$12:$D$12,'Runtime Calculator'!$B$17:$D$24)),\"\")","v":2},{"$f":"IFERROR( _xlfn.XLOOKUP($B19,'Runtime Calculator'!$A$17:$A$24,_xlfn.XLOOKUP(E$13,'Runtime Calculator'!$B$12:$D$12,'Runtime Calculator'!$B$17:$D$24)),\"\")","v":2.5},{"$f":"IFERROR( _xlfn.XLOOKUP($B19,'Runtime Calculator'!$A$17:$A$24,_xlfn.XLOOKUP(F$13,'Runtime Calculator'!$B$12:$D$12,'Runtime Calculator'!$B$17:$D$24)),\"\")","v":""},{"$f":"IFERROR( _xlfn.XLOOKUP($B19,'Runtime Calculator'!$A$17:$A$24,_xlfn.XLOOKUP(G$13,'Runtime Calculator'!$B$12:$D$12,'Runtime Calculator'!$B$17:$D$24)),\"\")","v":""},{"$f":"IFERROR( _xlfn.XLOOKUP($B19,'Runtime Calculator'!$A$17:$A$24,_xlfn.XLOOKUP(H$13,'Runtime Calculator'!$B$12:$D$12,'Runtime Calculator'!$B$17:$D$24)),\"\")","v":""}]
[null,"Max Current",{"$f":"IFERROR( _xlfn.XLOOKUP($B20,'Runtime Calculator'!$A$17:$A$24,_xlfn.XLOOKUP(C$13,'Runtime Calculator'!$B$12:$D$12,'Runtime Calculator'!$B$17:$D$24)),\"\")","v":35},{"$f":"IFERROR( _xlfn.XLOOKUP($B20,'Runtime Calculator'!$A$17:$A$24,_xlfn.XLOOKUP(D$13,'Runtime Calculator'!$B$12:$D$12,'Runtime Calculator'!$B$17:$D$24)),\"\")","v":120},{"$f":"IFERROR( _xlfn.XLOOKUP($B20,'Runtime Calculator'!$A$17:$A$24,_xlfn.XLOOKUP(E$13,'Runtime Calculator'!$B$12:$D$12,'Runtime Calculator'!$B$17:$D$24)),\"\")","v":45},{"$f":"IFERROR( _xlfn.XLOOKUP($B20,'Runtime Calculator'!$A$17:$A$24,_xlfn.XLOOKUP(F$13,'Runtime Calculator'!$B$12:$D$12,'Runtime Calculator'!$B$17:$D$24)),\"\")","v":""},{"$f":"IFERROR( _xlfn.XLOOKUP($B20,'Runtime Calculator'!$A$17:$A$24,_xlfn.XLOOKUP(G$13,'Runtime Calculator'!$B$12:$D$12,'Runtime Calculator'!$B$17:$D$24)),\"\")","v":""},{"$f":"IFERROR( _xlfn.XLOOKUP($B20,'Runtime Calculator'!$A$17:$A$24,_xlfn.XLOOKUP(H$13,'Runtime Calculator'!$B$12:$D$12,'Runtime Calculator'!$B$17:$D$24)),\"\")","v":""}]
[null,"Max Charge",{"$f":"IFERROR( _xlfn.XLOOKUP($B21,'Runtime Calculator'!$A$17:$A$24,_xlfn.XLOOKUP(C$13,'Runtime Calculator'!$B$12:$D$12,'Runtime Calculator'!$B$17:$D$24)),\"\")","v":6},{"$f":"IFERROR( _xlfn.XLOOKUP($B21,'Runtime Calculator'!$A$17:$A$24,_xlfn.XLOOKUP(D$13,'Runtime Calculator'!$B$12:$D$12,'Runtime Calculator'!$B$17:$D$24)),\"\")","v":10},{"$f":"IFERROR( _xlfn.XLOOKUP($B21,'Runtime Calculator'!$A$17:$A$24,_xlfn.XLOOKUP(E$13,'Runtime Calculator'!$B$12:$D$12,'Runtime Calculator'!$B$17:$D$24)),\"\")","v":0},{"$f":"IFERROR( _xlfn.XLOOKUP($B21,'Runtime Calculator'!$A$17:$A$24,_xlfn.XLOOKUP(F$13,'Runtime Calculator'!$B$12:$D$12,'Runtime Calculator'!$B$17:$D$24)),\"\")","v":""},{"$f":"IFERROR( _xlfn.XLOOKUP($B21,'Runtime Calculator'!$A$17:$A$24,_xlfn.XLOOKUP(G$13,'Runtime Calculator'!$B$12:$D$12,'Runtime Calculator'!$B$17:$D$24)),\"\")","v":""},{"$f":"IFERROR( _xlfn.XLOOKUP($B21,'Runtime Calculator'!$A$17:$A$24,_xlfn.XLOOKUP(H$13,'Runtime Calculator'!$B$12:$D$12,'Runtime Calculator'!$B$17:$D$24)),\"\")","v":""}]
[null,"Standard Charge Current",{"$f":"IFERROR( _xlfn.XLOOKUP($B22,'Runtime Calculator'!$A$17:$A$24,_xlfn.XLOOKUP(C$13,'Runtime Calculator'!$B$12:$D$12,'Runtime Calculator'!$B$17:$D$24)),\"\")","v":2.6},{"$f":"IFERROR( _xlfn.XLOOKUP($B22,'Runtime Calculator'!$A$17:$A$24,_xlfn.XLOOKUP(D$13,'Runtime Calculator'!$B$12:$D$12,'Runtime Calculator'!$B$17:$D$24)),\"\")","v":3},{"$f":"IFERROR( _xlfn.XLOOKUP($B22,'Runtime Calculator'!$A$17:$A$24,_xlfn.XLOOKUP(E$13,'Runtime Calculator'!$B$12:$D$12,'Runtime Calculator'!$B$17:$D$24)),\"\")","v":4.2},{"$f":"IFERROR( _xlfn.XLOOKUP($B22,'Runtime Calculator'!$A$17:$A$24,_xlfn.XLOOKUP(F$13,'Runtime Calculator'!$B$12:$D$12,'Runtime Calculator'!$B$17:$D$24)),\"\")","v":""},{"$f":"IFERROR( _xlfn.XLOOKUP($B22,'Runtime Calculator'!$A$17:$A$24,_xlfn.XLOOKUP(G$13,'Runtime Calculator'!$B$12:$D$12,'Runtime Calculator'!$B$17:$D$24)),\"\")","v":""},{"$f":"IFERROR( _xlfn.XLOOKUP($B22,'Runtime Calculator'!$A$17:$A$24,_xlfn.XLOOKUP(H$13,'Runtime Calculator'!$B$12:$D$12,'Runtime Calculator'!$B$17:$D$24)),\"\")","v":""}]
[null,"Standard Charge Time",{"$f":"IFERROR( _xlfn.XLOOKUP($B23,'Runtime Calculator'!$A$17:$A$24,_xlfn.XLOOKUP(C$13,'Runtime Calculator'!$B$12:$D$12,'Runtime Calculator'!$B$17:$D$24)),\"\")","v":1.5},{"$f":"IFERROR( _xlfn.XLOOKUP($B23,'Runtime Calculator'!$A$17:$A$24,_xlfn.XLOOKUP(D$13,'Runtime Calculator'!$B$12:$D$12,'Runtime Calculator'!$B$17:$D$24)),\"\")","v":0},{"$f":"IFERROR( _xlfn.XLOOKUP($B23,'Runtime Calculator'!$A$17:$A$24,_xlfn.XLOOKUP(E$13,'Runtime Calculator'!$B$12:$D$12,'Runtime Calculator'!$B$17:$D$24)),\"\")","v":1.5},{"$f":"IFERROR( _xlfn.XLOOKUP($B23,'Runtime Calculator'!$A$17:$A$24,_xlfn.XLOOKUP(F$13,'Runtime Calculator'!$B$12:$D$12,'Runtime Calculator'!$B$17:$D$24)),\"\")","v":""},{"$f":"IFERROR( _xlfn.XLOOKUP($B23,'Runtime Calculator'!$A$17:$A$24,_xlfn.XLOOKUP(G$13,'Runtime Calculator'!$B$12:$D$12,'Runtime Calculator'!$B$17:$D$24)),\"\")","v":""},{"$f":"IFERROR( _xlfn.XLOOKUP($B23,'Runtime Calculator'!$A$17:$A$24,_xlfn.XLOOKUP(H$13,'Runtime Calculator'!$B$12:$D$12,'Runtime Calculator'!$B$17:$D$24)),\"\")","v":""}]
[]
[null,null,"Battery Pack Characteristics"]
[null,"Pack Voltage",{"$f":"IFERROR(_xlfn.XLOOKUP($B26,'Runtime Calculator'!$A$29:$A$38,_xlfn.XLOOKUP(C$13,'Runtime Calculator'!$B$28:$D$28,'Runtime Calculator'!$B$29:$D$38,\"\")),\"\")","v":18},{"$f":"IFERROR(_xlfn.XLOOKUP($B26,'Runtime Calculator'!$A$29:$A$38,_xlfn.XLOOKUP(D$13,'Runtime Calculator'!$B$28:$D$28,'Runtime Calculator'!$B$29:$D$38,\"\")),\"\")","v":16.5},{"$f":"IFERROR(_xlfn.XLOOKUP($B26,'Runtime Calculator'!$A$29:$A$38,_xlfn.XLOOKUP(E$13,'Runtime Calculator'!$B$28:$D$28,'Runtime Calculator'!$B$29:$D$38,\"\")),\"\")","v":18},{"$f":"IFERROR(_xlfn.XLOOKUP($B26,'Runtime Calculator'!$A$29:$A$38,_xlfn.XLOOKUP(F$13,'Runtime Calculator'!$B$28:$D$28,'Runtime Calculator'!$B$29:$D$38,\"\")),\"\")","v":""},{"$f":"IFERROR(_xlfn.XLOOKUP($B26,'Runtime Calculator'!$A$29:$A$38,_xlfn.XLOOKUP(G$13,'Runtime Calculator'!$B$28:$D$28,'Runtime Calculator'!$B$29:$D$38,\"\")),\"\")","v":""},{"$f":"IFERROR(_xlfn.XLOOKUP($B26,'Runtime Calculator'!$A$29:$A$38,_xlfn.XLOOKUP(H$13,'Runtime Calculator'!$B$28:$D$28,'Runtime Calculator'!$B$29:$D$38,\"\")),\"\")","v":""}]
[null,"Pack Cutoff Voltage",{"$f":"IFERROR(_xlfn.XLOOKUP($B27,'Runtime Calculator'!$A$29:$A$38,_xlfn.XLOOKUP(C$13,'Runtime Calculator'!$B$28:$D$28,'Runtime Calculator'!$B$29:$D$38,\"\")),\"\")","v":12.5},{"$f":"IFERROR(_xlfn.XLOOKUP($B27,'Runtime Calculator'!$A$29:$A$38,_xlfn.XLOOKUP(D$13,'Runtime Calculator'!$B$28:$D$28,'Runtime Calculator'!$B$29:$D$38,\"\")),\"\")","v":10},{"$f":"IFERROR(_xlfn.XLOOKUP($B27,'Runtime Calculator'!$A$29:$A$38,_xlfn.XLOOKUP(E$13,'Runtime Calculator'!$B$28:$D$28,'Runtime Calculator'!$B$29:$D$38,\"\")),\"\")","v":12.5},{"$f":"IFERROR(_xlfn.XLOOKUP($B27,'Runtime Calculator'!$A$29:$A$38,_xlfn.XLOOKUP(F$13,'Runtime Calculator'!$B$28:$D$28,'Runtime Calculator'!$B$29:$D$38,\"\")),\"\")","v":""},{"$f":"IFERROR(_xlfn.XLOOKUP($B27,'Runtime Calculator'!$A$29:$A$38,_xlfn.XLOOKUP(G$13,'Runtime Calculator'!$B$28:$D$28,'Runtime Calculator'!$B$29:$D$38,\"\")),\"\")","v":""},{"$f":"IFERROR(_xlfn.XLOOKUP($B27,'Runtime Calculator'!$A$29:$A$38,_xlfn.XLOOKUP(H$13,'Runtime Calculator'!$B$28:$D$28,'Runtime Calculator'!$B$29:$D$38,\"\")),\"\")","v":""}]
[null,"Rated Capacity (mAh)",{"$f":"IFERROR(_xlfn.XLOOKUP($B28,'Runtime Calculator'!$A$29:$A$38,_xlfn.XLOOKUP(C$13,'Runtime Calculator'!$B$28:$D$28,'Runtime Calculator'!$B$29:$D$38,\"\")),\"\")","v":5200},{"$f":"IFERROR(_xlfn.XLOOKUP($B28,'Runtime Calculator'!$A$29:$A$38,_xlfn.XLOOKUP(D$13,'Runtime Calculator'!$B$28:$D$28,'Runtime Calculator'!$B$29:$D$38,\"\")),\"\")","v":5200},{"$f":"IFERROR(_xlfn.XLOOKUP($B28,'Runtime Calculator'!$A$29:$A$38,_xlfn.XLOOKUP(E$13,'Runtime Calculator'!$B$28:$D$28,'Runtime Calculator'!$B$29:$D$38,\"\")),\"\")","v":8400},{"$f":"IFERROR(_xlfn.XLOOKUP($B28,'Runtime Calculator'!$A$29:$A$38,_xlfn.XLOOKUP(F$13,'Runtime Calculator'!$B$28:$D$28,'Runtime Calculator'!$B$29:$D$38,\"\")),\"\")","v":""},{"$f":"IFERROR(_xlfn.XLOOKUP($B28,'Runtime Calculator'!$A$29:$A$38,_xlfn.XLOOKUP(G$13,'Runtime Calculator'!$B$28:$D$28,'Runtime Calculator'!$B$29:$D$38,\"\")),\"\")","v":""},{"$f":"IFERROR(_xlfn.XLOOKUP($B28,'Runtime Calculator'!$A$29:$A$38,_xlfn.XLOOKUP(H$13,'Runtime Calculator'!$B$28:$D$28,'Runtime Calculator'!$B$29:$D$38,\"\")),\"\")","v":""}]
[null,"Rated Capacity (Ah)",{"$f":"IFERROR(_xlfn.XLOOKUP($B29,'Runtime Calculator'!$A$29:$A$38,_xlfn.XLOOKUP(C$13,'Runtime Calculator'!$B$28:$D$28,'Runtime Calculator'!$B$29:$D$38,\"\")),\"\")","v":5.2},{"$f":"IFERROR(_xlfn.XLOOKUP($B29,'Runtime Calculator'!$A$29:$A$38,_xlfn.XLOOKUP(D$13,'Runtime Calculator'!$B$28:$D$28,'Runtime Calculator'!$B$29:$D$38,\"\")),\"\")","v":5.2},{"$f":"IFERROR(_xlfn.XLOOKUP($B29,'Runtime Calculator'!$A$29:$A$38,_xlfn.XLOOKUP(E$13,'Runtime Calculator'!$B$28:$D$28,'Runtime Calculator'!$B$29:$D$38,\"\")),\"\")","v":8.4},{"$f":"IFERROR(_xlfn.XLOOKUP($B29,'Runtime Calculator'!$A$29:$A$38,_xlfn.XLOOKUP(F$13,'Runtime Calculator'!$B$28:$D$28,'Runtime Calculator'!$B$29:$D$38,\"\")),\"\")","v":""},{"$f":"IFERROR(_xlfn.XLOOKUP($B29,'Runtime Calculator'!$A$29:$A$38,_xlfn.XLOOKUP(G$13,'Runtime Calculator'!$B$28:$D$28,'Runtime Calculator'!$B$29:$D$38,\"\")),\"\")","v":""},{"$f":"IFERROR(_xlfn.XLOOKUP($B29,'Runtime Calculator'!$A$29:$A$38,_xlfn.XLOOKUP(H$13,'Runtime Calculator'!$B$28:$D$28,'Runtime Calculator'!$B$29:$D$38,\"\")),\"\")","v":""}]
[null,"Wh",{"$f":"IFERROR(_xlfn.XLOOKUP($B30,'Runtime Calculator'!$A$29:$A$38,_xlfn.XLOOKUP(C$13,'Runtime Calculator'!$B$28:$D$28,'Runtime Calculator'!$B$29:$D$38,\"\")),\"\")","v":93.6},{"$f":"IFERROR(_xlfn.XLOOKUP($B30,'Runtime Calculator'!$A$29:$A$38,_xlfn.XLOOKUP(D$13,'Runtime Calculator'!$B$28:$D$28,'Runtime Calculator'!$B$29:$D$38,\"\")),\"\")","v":85.8},{"$f":"IFERROR(_xlfn.XLOOKUP($B30,'Runtime Calculator'!$A$29:$A$38,_xlfn.XLOOKUP(E$13,'Runtime Calculator'!$B$28:$D$28,'Runtime Calculator'!$B$29:$D$38,\"\")),\"\")","v":151.19999999999999},{"$f":"IFERROR(_xlfn.XLOOKUP($B30,'Runtime Calculator'!$A$29:$A$38,_xlfn.XLOOKUP(F$13,'Runtime Calculator'!$B$28:$D$28,'Runtime Calculator'!$B$29:$D$38,\"\")),\"\")","v":""},{"$f":"IFERROR(_xlfn.XLOOKUP($B30,'Runtime Calculator'!$A$29:$A$38,_xlfn.XLOOKUP(G$13,'Runtime Calculator'!$B$28:$D$28,'Runtime Calculator'!$B$29:$D$38,\"\")),\"\")","v":""},{"$f":"IFERROR(_xlfn.XLOOKUP($B30,'Runtime Calculator'!$A$29:$A$38,_xlfn.XLOOKUP(H$13,'Runtime Calculator'!$B$28:$D$28,'Runtime Calculator'!$B$29:$D$38,\"\")),\"\")","v":""}]
{"$rows_left_out":10}
{"sheet":"Runtime Calculator","index":1,"n_rows":48,"n_cols":7,"rows_kept":48,"cut":false,"hidden":false,"merged":[]}
["Calculates Runtime Based on Configuration",null,"Insert new columns in between outer columns to maintain formulas on \"Battery Calculator for Runtime\" tab"]
[]
["Input"]
["Series",{"$f":"+'Battery Calculator for Runtime'!$C5","v":5},{"$f":"+'Battery Calculator for Runtime'!$C5","v":5},{"$f":"+'Battery Calculator for Runtime'!$C5","v":5},{"$f":"+'Battery Calculator for Runtime'!$C5","v":5},{"$f":"+'Battery Calculator for Runtime'!$C5","v":5},{"$f":"+'Battery Calculator for Runtime'!$C5","v":5}]
["Paralell",{"$f":"+'Battery Calculator for Runtime'!$C6","v":2},{"$f":"+'Battery Calculator for Runtime'!$C6","v":2},{"$f":"+'Battery Calculator for Runtime'!$C6","v":2},{"$f":"+'Battery Calculator for Runtime'!$C6","v":2},{"$f":"+'Battery Calculator for Runtime'!$C6","v":2},{"$f":"+'Battery Calculator for Runtime'!$C6","v":2}]
["Standard Current",{"$f":"+'Battery Calculator for Runtime'!$C7","v":5},{"$f":"+'Battery Calculator for Runtime'!$C7","v":5},{"$f":"+'Battery Calculator for Runtime'!$C7","v":5},{"$f":"+'Battery Calculator for Runtime'!$C7","v":5},{"$f":"+'Battery Calculator for Runtime'!$C7","v":5},{"$f":"+'Battery Calculator for Runtime'!$C7","v":5}]
["Max Current",{"$f":"+'Battery Calculator for Runtime'!$C8","v":30},{"$f":"+'Battery Calculator for Runtime'!$C8","v":30},{"$f":"+'Battery Calculator for Runtime'!$C8","v":30},{"$f":"+'Battery Calculator for Runtime'!$C8","v":30},{"$f":"+'Battery Calculator for Runtime'!$C8","v":30},{"$f":"+'Battery Calculator for Runtime'!$C8","v":30}]
[]
["Cell Data"]
["Cell Type","High Power","High Power","High Power","High Capacity","High Capacity","High Power"]
["Vendor","Moli","LithiumWerks","Moli","LG","LG","Panasonic"]
["Model","INR18650-P26A","ANR26650M1B","INR-21700-P42A","INR18650MJ1","INR18650MJ1","UR18650A"]
["Chemistry","Lithium Ion","Lithium Iron Phosphate","Lithium Ion","Lithium Ion","Lithium Ion","Lithium Ion"]
["Size",18650,26650,21700,18650,18650,18650]
["Discharge per Cell",2.5,2.5,2.5,2.5,2.5,2.5]
[]
["Nominal Capacity",2600,2600,4200]
["Minimum Capacity",null,2500,4000]
["Voltage",3.6,3.3,3.6]
["Cutoff Voltag",2.5,2,2.5]
["Max Current",35,120,45]
["Max Charge",6,10]
["Standard Charge Current",2.6,3,4.2]
["Standard Charge Time",1.5,null,1.5]
[]
[]
["Output"]
["Cell",{"$f":"B$12","v":"INR18650-P26A"},{"$f":"C$12","v":"ANR26650M1B"},"INR-21700-P42A",{"$f":"E$12","v":"INR18650MJ1"},{"$f":"F$12","v":"INR18650MJ1"},{"$f":"G$12","v":"UR18650A"}]
["Pack Voltage",{"$f":"+B4*B19","v":18},16.5,18,{"$f":"+E4*E19","v":0},{"$f":"+F4*F19","v":0},{"$f":"+G4*G19","v":0}]
["Pack Cutoff Voltage",{"$f":"+B4*B20","v":12.5},10,12.5,{"$f":"+E4*E20","v":0},{"$f":"+F4*F20","v":0},{"$f":"+G4*G20","v":0}]
{"$rows_left_out":19}
{"sheet":"Data","index":2,"n_rows":16,"n_cols":9,"rows_kept":16,"cut":false,"hidden":false,"merged":[]}
["Discharge to","Cell","Discharge Current","Capacity"]
[3,"INR18650-P26A",0.52,2500,null,null,null,null,"Reapply Sort after adding more items"]
[3,"INR18650-P26A",2.6,2300]
[3,"INR18650-P26A",10,2350]
[3,"INR18650-P26A",20,2200]
[2.5,"ANR26650M1B",5,2540]
[2.5,"ANR26650M1B",50,2510]
[2.5,"INR18650-P26A",0.52,2550]
[2.5,"INR18650-P26A",2.6,2450]
[2.5,"INR18650-P26A",10,2500]
[2.5,"INR18650-P26A",20,2500]
[2.5,"INR-21700-P42A",0.84,4250]
[2.5,"INR-21700-P42A",4.2,4200]
[2.5,"INR-21700-P42A",10,4175]
[2.5,"INR-21700-P42A",20,4175]
[2.5,"INR-21700-P42A",30,4100]